Executing tasks: [:app:assembleDebug] in project /Users/sublime/Desktop/apmobile/MDM/platforms/android
Configure project :app WARNING: The option 'android.useDeprecatedNdk' is deprecated. The current default is 'false'. It has been removed from the current version of the Android Gradle plugin. NdkCompile is no longer supported
Task :app:preBuild UP-TO-DATE Task :app:preDebugBuild UP-TO-DATE Task :CordovaLib:preBuild UP-TO-DATE Task :CordovaLib:preDebugBuild UP-TO-DATE Task :CordovaLib:compileDebugAidl NO-SOURCE Task :app:compileDebugAidl NO-SOURCE Task :CordovaLib:packageDebugRenderscript NO-SOURCE Task :app:compileDebugRenderscript NO-SOURCE Task :app:generateDebugBuildConfig UP-TO-DATE Task :app:javaPreCompileDebug UP-TO-DATE Task :CordovaLib:writeDebugAarMetadata UP-TO-DATE Task :app:generateDebugResValues UP-TO-DATE Task :app:generateDebugResources UP-TO-DATE Task :CordovaLib:compileDebugRenderscript UP-TO-DATE Task :CordovaLib:generateDebugResValues UP-TO-DATE Task :CordovaLib:generateDebugResources UP-TO-DATE Task :CordovaLib:packageDebugResources UP-TO-DATE Task :app:mergeDebugResources UP-TO-DATE Task :app:createDebugCompatibleScreenManifests UP-TO-DATE Task :app:extractDeepLinksDebug UP-TO-DATE Task :CordovaLib:extractDeepLinksDebug UP-TO-DATE Task :CordovaLib:processDebugManifest UP-TO-DATE Task :app:processDebugMainManifest Task :app:processDebugManifest Task :CordovaLib:compileDebugLibraryResources UP-TO-DATE Task :app:checkDebugAarMetadata Task :CordovaLib:generateDebugBuildConfig UP-TO-DATE Task :CordovaLib:javaPreCompileDebug UP-TO-DATE Task :app:mergeDebugNativeDebugMetadata NO-SOURCE Task :app:mergeDebugShaders UP-TO-DATE Task :app:compileDebugShaders NO-SOURCE Task :app:generateDebugAssets UP-TO-DATE Task :CordovaLib:parseDebugLocalResources Task :CordovaLib:mergeDebugShaders UP-TO-DATE Task :CordovaLib:compileDebugShaders NO-SOURCE Task :CordovaLib:generateDebugAssets UP-TO-DATE Task :CordovaLib:packageDebugAssets UP-TO-DATE Task :app:mergeDebugAssets UP-TO-DATE Task :app:compressDebugAssets UP-TO-DATE Task :app:processDebugJavaRes NO-SOURCE Task :CordovaLib:processDebugJavaRes NO-SOURCE Task :CordovaLib:bundleLibResDebug NO-SOURCE Task :app:mergeDebugJavaResource UP-TO-DATE Task :app:desugarDebugFileDependencies Task :CordovaLib:generateDebugRFile
Task :CordovaLib:compileDebugJavaWithJavac FAILED An exception has occurred in the compiler (1.8.0_242-release). Please file a bug against the Java compiler via the Java bug reporting page (http://bugreport.java.com) after checking the Bug Database (http://bugs.java.com) for duplicates. Include your program and the following diagnostic in your report. Thank you. java.lang.AssertionError: annotationType(): unrecognized Attribute name MODULE (class com.sun.tools.javac.util.UnsharedNameTable$NameImpl) at com.sun.tools.javac.util.Assert.error(Assert.java:133) at com.sun.tools.javac.code.TypeAnnotations.annotationType(TypeAnnotations.java:231) at com.sun.tools.javac.code.TypeAnnotations$TypeAnnotationPositions.separateAnnotationsKinds(TypeAnnotations.java:294) at com.sun.tools.javac.code.TypeAnnotations$TypeAnnotationPositions.visitMethodDef(TypeAnnotations.java:1066) at com.sun.tools.javac.tree.JCTree$JCMethodDecl.accept(JCTree.java:778) at com.sun.tools.javac.tree.TreeScanner.scan(TreeScanner.java:49) at com.sun.tools.javac.code.TypeAnnotations$TypeAnnotationPositions.scan(TypeAnnotations.java:275) at com.sun.tools.javac.tree.TreeScanner.scan(TreeScanner.java:57) at com.sun.tools.javac.code.TypeAnnotations$TypeAnnotationPositions.visitClassDef(TypeAnnotations.java:1042) at com.sun.tools.javac.tree.JCTree$JCClassDecl.accept(JCTree.java:693) at com.sun.tools.javac.tree.TreeScanner.scan(TreeScanner.java:49) at com.sun.tools.javac.code.TypeAnnotations$TypeAnnotationPositions.scan(TypeAnnotations.java:275) at com.sun.tools.javac.code.TypeAnnotations$1.run(TypeAnnotations.java:127) at com.sun.tools.javac.comp.Annotate.flush(Annotate.java:152) at com.sun.tools.javac.comp.Annotate.enterDone(Annotate.java:129) at com.sun.tools.javac.comp.Enter.complete(Enter.java:512) at com.sun.tools.javac.comp.Enter.main(Enter.java:471) at com.sun.tools.javac.main.JavaCompiler.enterTrees(JavaCompiler.java:982) at com.sun.tools.javac.main.JavaCompiler.compile(JavaCompiler.java:857) at com.sun.tools.javac.main.Main.compile(Main.java:523) at com.sun.tools.javac.api.JavacTaskImpl.doCall(JavacTaskImpl.java:129) at com.sun.tools.javac.api.JavacTaskImpl.call(JavacTaskImpl.java:138) at org.gradle.internal.compiler.java.IncrementalCompileTask.call(IncrementalCompileTask.java:74) at org.gradle.api.internal.tasks.compile.AnnotationProcessingCompileTask.call(AnnotationProcessingCompileTask.java:93) at org.gradle.api.internal.tasks.compile.ResourceCleaningCompilationTask.call(ResourceCleaningCompilationTask.java:57) at org.gradle.api.internal.tasks.compile.JdkJavaCompiler.execute(JdkJavaCompiler.java:55) at org.gradle.api.internal.tasks.compile.JdkJavaCompiler.execute(JdkJavaCompiler.java:40) at org.gradle.api.internal.tasks.compile.NormalizingJavaCompiler.delegateAndHandleErrors(NormalizingJavaCompiler.java:97) at org.gradle.api.internal.tasks.compile.NormalizingJavaCompiler.execute(NormalizingJavaCompiler.java:51) at org.gradle.api.internal.tasks.compile.NormalizingJavaCompiler.execute(NormalizingJavaCompiler.java:37) at org.gradle.api.internal.tasks.compile.AnnotationProcessorDiscoveringCompiler.execute(AnnotationProcessorDiscoveringCompiler.java:51) at org.gradle.api.internal.tasks.compile.AnnotationProcessorDiscoveringCompiler.execute(AnnotationProcessorDiscoveringCompiler.java:37) at org.gradle.api.internal.tasks.compile.ModuleApplicationNameWritingCompiler.execute(ModuleApplicationNameWritingCompiler.java:46) at org.gradle.api.internal.tasks.compile.ModuleApplicationNameWritingCompiler.execute(ModuleApplicationNameWritingCompiler.java:36) at org.gradle.api.internal.tasks.compile.CleaningJavaCompiler.execute(CleaningJavaCompiler.java:53) at org.gradle.api.internal.tasks.compile.incremental.IncrementalCompilerFactory.lambda$createRebuildAllCompiler$0(IncrementalCompilerFactory.java:98) at org.gradle.api.internal.tasks.compile.incremental.IncrementalResultStoringCompiler.execute(IncrementalResultStoringCompiler.java:60) at org.gradle.api.internal.tasks.compile.incremental.IncrementalResultStoringCompiler.execute(IncrementalResultStoringCompiler.java:44) at org.gradle.api.internal.tasks.compile.CompileJavaBuildOperationReportingCompiler$2.call(CompileJavaBuildOperationReportingCompiler.java:59) at org.gradle.api.internal.tasks.compile.CompileJavaBuildOperationReportingCompiler$2.call(CompileJavaBuildOperationReportingCompiler.java:51) at org.gradle.internal.operations.DefaultBuildOperationExecutor$CallableBuildOperationWorker.execute(DefaultBuildOperationExecutor.java:409) at org.gradle.internal.operations.DefaultBuildOperationExecutor$CallableBuildOperationWorker.execute(DefaultBuildOperationExecutor.java:399) at org.gradle.internal.operations.DefaultBuildOperationExecutor$1.execute(DefaultBuildOperationExecutor.java:157) at org.gradle.internal.operations.DefaultBuildOperationExecutor.execute(DefaultBuildOperationExecutor.java:242) at org.gradle.internal.operations.DefaultBuildOperationExecutor.execute(DefaultBuildOperationExecutor.java:150) at org.gradle.internal.operations.DefaultBuildOperationExecutor.call(DefaultBuildOperationExecutor.java:94) at org.gradle.internal.operations.DelegatingBuildOperationExecutor.call(DelegatingBuildOperationExecutor.java:36) at org.gradle.api.internal.tasks.compile.CompileJavaBuildOperationReportingCompiler.execute(CompileJavaBuildOperationReportingCompiler.java:51) at org.gradle.api.tasks.compile.JavaCompile.performCompilation(JavaCompile.java:293) at org.gradle.api.tasks.compile.JavaCompile.performIncrementalCompilation(JavaCompile.java:203) at org.gradle.api.tasks.compile.JavaCompile.compile(JavaCompile.java:183) at sun.reflect.NativeMethodAccessorImpl.invoke0(Native Method) at sun.reflect.NativeMethodAccessorImpl.invoke(NativeMethodAccessorImpl.java:62) at sun.reflect.DelegatingMethodAccessorImpl.invoke(DelegatingMethodAccessorImpl.java:43) at java.lang.reflect.Method.invoke(Method.java:498) at org.gradle.internal.reflect.JavaMethod.invoke(JavaMethod.java:104) at org.gradle.api.internal.project.taskfactory.IncrementalInputsTaskAction.doExecute(IncrementalInputsTaskAction.java:32) at org.gradle.api.internal.project.taskfactory.StandardTaskAction.execute(StandardTaskAction.java:42) at org.gradle.api.internal.project.taskfactory.AbstractIncrementalTaskAction.execute(AbstractIncrementalTaskAction.java:25) at org.gradle.api.internal.project.taskfactory.StandardTaskAction.execute(StandardTaskAction.java:28) at org.gradle.api.internal.tasks.execution.ExecuteActionsTaskExecuter$3.run(ExecuteActionsTaskExecuter.java:569) at org.gradle.internal.operations.DefaultBuildOperationExecutor$RunnableBuildOperationWorker.execute(DefaultBuildOperationExecutor.java:395) at org.gradle.internal.operations.DefaultBuildOperationExecutor$RunnableBuildOperationWorker.execute(DefaultBuildOperationExecutor.java:387) at org.gradle.internal.operations.DefaultBuildOperationExecutor$1.execute(DefaultBuildOperationExecutor.java:157) at org.gradle.internal.operations.DefaultBuildOperationExecutor.execute(DefaultBuildOperationExecutor.java:242) at org.gradle.internal.operations.DefaultBuildOperationExecutor.execute(DefaultBuildOperationExecutor.java:150) at org.gradle.internal.operations.DefaultBuildOperationExecutor.run(DefaultBuildOperationExecutor.java:84) at org.gradle.internal.operations.DelegatingBuildOperationExecutor.run(DelegatingBuildOperationExecutor.java:31) at org.gradle.api.internal.tasks.execution.ExecuteActionsTaskExecuter.executeAction(ExecuteActionsTaskExecuter.java:554) at org.gradle.api.internal.tasks.execution.ExecuteActionsTaskExecuter.executeActions(ExecuteActionsTaskExecuter.java:537) at org.gradle.api.internal.tasks.execution.ExecuteActionsTaskExecuter.access$300(ExecuteActionsTaskExecuter.java:108) at org.gradle.api.internal.tasks.execution.ExecuteActionsTaskExecuter$TaskExecution.executeWithPreviousOutputFiles(ExecuteActionsTaskExecuter.java:278) at org.gradle.api.internal.tasks.execution.ExecuteActionsTaskExecuter$TaskExecution.execute(ExecuteActionsTaskExecuter.java:267) at org.gradle.internal.execution.steps.ExecuteStep.lambda$execute$0(ExecuteStep.java:32) at java.util.Optional.map(Optional.java:215) at org.gradle.internal.execution.steps.ExecuteStep.execute(ExecuteStep.java:32) at org.gradle.internal.execution.steps.ExecuteStep.execute(ExecuteStep.java:26) at org.gradle.internal.execution.steps.CleanupOutputsStep.execute(CleanupOutputsStep.java:67) at org.gradle.internal.execution.steps.CleanupOutputsStep.execute(CleanupOutputsStep.java:36) at org.gradle.internal.execution.steps.ResolveInputChangesStep.execute(ResolveInputChangesStep.java:49) at org.gradle.internal.execution.steps.ResolveInputChangesStep.execute(ResolveInputChangesStep.java:34) at org.gradle.internal.execution.steps.CancelExecutionStep.execute(CancelExecutionStep.java:43) at org.gradle.internal.execution.steps.TimeoutStep.executeWithoutTimeout(TimeoutStep.java:73) at org.gradle.internal.execution.steps.TimeoutStep.execute(TimeoutStep.java:54) at org.gradle.internal.execution.steps.CatchExceptionStep.execute(CatchExceptionStep.java:34) at org.gradle.internal.execution.steps.CreateOutputsStep.execute(CreateOutputsStep.java:44) at org.gradle.internal.execution.steps.SnapshotOutputsStep.execute(SnapshotOutputsStep.java:54) at org.gradle.internal.execution.steps.SnapshotOutputsStep.execute(SnapshotOutputsStep.java:38) at org.gradle.internal.execution.steps.BroadcastChangingOutputsStep.execute(BroadcastChangingOutputsStep.java:49) at org.gradle.internal.execution.steps.CacheStep.executeWithoutCache(CacheStep.java:159) at org.gradle.internal.execution.steps.CacheStep.execute(CacheStep.java:72) at org.gradle.internal.execution.steps.CacheStep.execute(CacheStep.java:43) at org.gradle.internal.execution.steps.StoreExecutionStateStep.execute(StoreExecutionStateStep.java:44) at org.gradle.internal.execution.steps.StoreExecutionStateStep.execute(StoreExecutionStateStep.java:33) at org.gradle.internal.execution.steps.RecordOutputsStep.execute(RecordOutputsStep.java:38) at org.gradle.internal.execution.steps.RecordOutputsStep.execute(RecordOutputsStep.java:24) at org.gradle.internal.execution.steps.SkipUpToDateStep.executeBecause(SkipUpToDateStep.java:92) at org.gradle.internal.execution.steps.SkipUpToDateStep.lambda$execute$0(SkipUpToDateStep.java:85) at java.util.Optional.map(Optional.java:215) at org.gradle.internal.execution.steps.SkipUpToDateStep.execute(SkipUpToDateStep.java:55) at org.gradle.internal.execution.steps.SkipUpToDateStep.execute(SkipUpToDateStep.java:39) at org.gradle.internal.execution.steps.ResolveChangesStep.execute(ResolveChangesStep.java:76) at org.gradle.internal.execution.steps.ResolveChangesStep.execute(ResolveChangesStep.java:37) at org.gradle.internal.execution.steps.legacy.MarkSnapshottingInputsFinishedStep.execute(MarkSnapshottingInputsFinishedStep.java:36) at org.gradle.internal.execution.steps.legacy.MarkSnapshottingInputsFinishedStep.execute(MarkSnapshottingInputsFinishedStep.java:26) at org.gradle.internal.execution.steps.ResolveCachingStateStep.execute(ResolveCachingStateStep.java:94) at org.gradle.internal.execution.steps.ResolveCachingStateStep.execute(ResolveCachingStateStep.java:49) at org.gradle.internal.execution.steps.CaptureStateBeforeExecutionStep.execute(CaptureStateBeforeExecutionStep.java:79) at org.gradle.internal.execution.steps.CaptureStateBeforeExecutionStep.execute(CaptureStateBeforeExecutionStep.java:53) at org.gradle.internal.execution.steps.ValidateStep.execute(ValidateStep.java:74) at org.gradle.internal.execution.steps.SkipEmptyWorkStep.lambda$execute$2(SkipEmptyWorkStep.java:78) at java.util.Optional.orElseGet(Optional.java:267) at org.gradle.internal.execution.steps.SkipEmptyWorkStep.execute(SkipEmptyWorkStep.java:78) at org.gradle.internal.execution.steps.SkipEmptyWorkStep.execute(SkipEmptyWorkStep.java:34) at org.gradle.internal.execution.steps.legacy.MarkSnapshottingInputsStartedStep.execute(MarkSnapshottingInputsStartedStep.java:39) at org.gradle.internal.execution.steps.LoadExecutionStateStep.execute(LoadExecutionStateStep.java:40) at org.gradle.internal.execution.steps.LoadExecutionStateStep.execute(LoadExecutionStateStep.java:28) at org.gradle.internal.execution.impl.DefaultWorkExecutor.execute(DefaultWorkExecutor.java:33) at org.gradle.api.internal.tasks.execution.ExecuteActionsTaskExecuter.executeIfValid(ExecuteActionsTaskExecuter.java:194) at org.gradle.api.internal.tasks.execution.ExecuteActionsTaskExecuter.execute(ExecuteActionsTaskExecuter.java:186) at org.gradle.api.internal.tasks.execution.CleanupStaleOutputsExecuter.execute(CleanupStaleOutputsExecuter.java:114) at org.gradle.api.internal.tasks.execution.FinalizePropertiesTaskExecuter.execute(FinalizePropertiesTaskExecuter.java:46) at org.gradle.api.internal.tasks.execution.ResolveTaskExecutionModeExecuter.execute(ResolveTaskExecutionModeExecuter.java:62) at org.gradle.api.internal.tasks.execution.SkipTaskWithNoActionsExecuter.execute(SkipTaskWithNoActionsExecuter.java:57) at org.gradle.api.internal.tasks.execution.SkipOnlyIfTaskExecuter.execute(SkipOnlyIfTaskExecuter.java:56) at org.gradle.api.internal.tasks.execution.CatchExceptionTaskExecuter.execute(CatchExceptionTaskExecuter.java:36) at org.gradle.api.internal.tasks.execution.EventFiringTaskExecuter$1.executeTask(EventFiringTaskExecuter.java:77) at org.gradle.api.internal.tasks.execution.EventFiringTaskExecuter$1.call(EventFiringTaskExecuter.java:55) at org.gradle.api.internal.tasks.execution.EventFiringTaskExecuter$1.call(EventFiringTaskExecuter.java:52) at org.gradle.internal.operations.DefaultBuildOperationExecutor$CallableBuildOperationWorker.execute(DefaultBuildOperationExecutor.java:409) at org.gradle.internal.operations.DefaultBuildOperationExecutor$CallableBuildOperationWorker.execute(DefaultBuildOperationExecutor.java:399) at org.gradle.internal.operations.DefaultBuildOperationExecutor$1.execute(DefaultBuildOperationExecutor.java:157) at org.gradle.internal.operations.DefaultBuildOperationExecutor.execute(DefaultBuildOperationExecutor.java:242) at org.gradle.internal.operations.DefaultBuildOperationExecutor.execute(DefaultBuildOperationExecutor.java:150) at org.gradle.internal.operations.DefaultBuildOperationExecutor.call(DefaultBuildOperationExecutor.java:94) at org.gradle.internal.operations.DelegatingBuildOperationExecutor.call(DelegatingBuildOperationExecutor.java:36) at org.gradle.api.internal.tasks.execution.EventFiringTaskExecuter.execute(EventFiringTaskExecuter.java:52) at org.gradle.execution.plan.LocalTaskNodeExecutor.execute(LocalTaskNodeExecutor.java:41) at org.gradle.execution.taskgraph.DefaultTaskExecutionGraph$InvokeNodeExecutorsAction.execute(DefaultTaskExecutionGraph.java:356) at org.gradle.execution.taskgraph.DefaultTaskExecutionGraph$InvokeNodeExecutorsAction.execute(DefaultTaskExecutionGraph.java:343) at org.gradle.execution.taskgraph.DefaultTaskExecutionGraph$BuildOperationAwareExecutionAction.execute(DefaultTaskExecutionGraph.java:336) at org.gradle.execution.taskgraph.DefaultTaskExecutionGraph$BuildOperationAwareExecutionAction.execute(DefaultTaskExecutionGraph.java:322) at org.gradle.execution.plan.DefaultPlanExecutor$ExecutorWorker.lambda$run$0(DefaultPlanExecutor.java:127) at org.gradle.execution.plan.DefaultPlanExecutor$ExecutorWorker.execute(DefaultPlanExecutor.java:191) at org.gradle.execution.plan.DefaultPlanExecutor$ExecutorWorker.executeNextNode(DefaultPlanExecutor.java:182) at org.gradle.execution.plan.DefaultPlanExecutor$ExecutorWorker.run(DefaultPlanExecutor.java:124) at org.gradle.internal.concurrent.ExecutorPolicy$CatchAndRecordFailures.onExecute(ExecutorPolicy.java:64) at org.gradle.internal.concurrent.ManagedExecutorImpl$1.run(ManagedExecutorImpl.java:48) at java.util.concurrent.ThreadPoolExecutor.runWorker(ThreadPoolExecutor.java:1149) at java.util.concurrent.ThreadPoolExecutor$Worker.run(ThreadPoolExecutor.java:624) at org.gradle.internal.concurrent.ThreadFactoryImpl$ManagedThreadRunnable.run(ThreadFactoryImpl.java:56) at java.lang.Thread.run(Thread.java:748)
Task :app:checkDebugDuplicateClasses Task :app:processDebugManifestForPackage
FAILURE: Build failed with an exception.
- What went wrong: Execution failed for task ':CordovaLib:compileDebugJavaWithJavac'.
Compilation failed; see the compiler error output for details.
Try: Run with --stacktrace option to get the stack trace. Run with --info or --debug option to get more log output. Run with --scan to get full insights.
Get more help at https://help.gradle.org
BUILD FAILED in 1s 30 actionable tasks: 9 executed, 21 up-to-date