- Try: Run with --stacktrace option to get the stack trace. Run with --info or --debug option to get more log output. Run with --scan to get full insights.
- Get more help at https://help.gradle.org BUILD FAILED in 17s error Failed to install the app. Make sure you have the Android development environment set up: https://reactnative.dev/docs/environment-setup. Error: Command failed: gradlew.bat app:installDebug -PreactNativeDevServerPort=8081 Warning: Mapping new ns http://schemas.android.com/repository/android/common/02 to old ns http://schemas.android.com/repository/android/common/01 Warning: Mapping new ns http://schemas.android.com/repository/android/generic/02 to old ns http://schemas.android.com/repository/android/generic/01 Warning: Mapping new ns http://schemas.android.com/sdk/android/repo/addon2/02 to old ns http://schemas.android.com/sdk/android/repo/addon2/01 Warning: Mapping new ns http://schemas.android.com/sdk/android/repo/repository2/02 to old ns http://schemas.android.com/sdk/android/repo/repository2/01 Warning: Mapping new ns http://schemas.android.com/sdk/android/repo/sys-img2/02 to old ns http://schemas.android.com/sdk/android/repo/sys-img2/01 C:\Users\admin\Desktop\Buddy\Buddy\android\app\src\main\java\com\buddy\MainActivity.java:8: error: cannot access ViewGroup public class MainActivity extends ReactActivity { ^ class file for android.view.ViewGroup not found 1 error FAILURE: Build failed with an exception.
- What went wrong: Execution failed for task ':app:compileDebugJavaWithJavac'.
Compilation failed; see the compiler error output for details.
- Try: Run with --stacktrace option to get the stack trace. Run with --info or --debug option to get more log output. Run with --scan to get full insights.
- Get more help at https://help.gradle.org BUILD FAILED in 17s
