Execution failed for task ':app:processDebugMainManifest'?

Viewed 137

FAILURE: Build failed with an exception.

  • What went wrong: Execution failed for task ':app:processDebugMainManifest'.

Unable to make field private final java.lang.String java.io.File.path accessible: module java.base does not "opens java.io" to unnamed module @6e12ea78

  • Try: Run with --stacktrace option to get the stack trace. Run with --info or --debug option to get more log output. Run with --scan to get full insights.

  • Get more help at https://help.gradle.org

Deprecated Gradle features were used in this build, making it incompatible with Gradle 8.0.

You can use '--warning-mode all' to show the individual deprecation warnings and determine if they come from your own scripts or plugins.

See https://docs.gradle.org/7.1.1/userguide/command_line_interface.html#sec:command_line_warnings

BUILD FAILED in 10s 15 actionable tasks: 1 executed, 14 up-to-date Command failed with exit code 1: D:\moodleApp\moodleapp\platforms\android\gradlew cdvBuildDebug -b D:\moodleApp\moodleapp\platforms\android\build.gradle [ERROR] An error occurred while running subprocess cordova.

    cordova.cmd build android exited with exit code 1.

    Re-running this command with the --verbose flag may provide more information.
0 Answers
Related