I was using Flutter 2.12 (or 2.13, I installed it like 2 months ago). The app was running fine in both web and android emulator.
I upgraded the flutter to 3 yesterday
flutter upgrade
flutter pub upgrade
flutter clean
dart pub get
flutter pub get
dart run build_runner build
Now the web one runs fine. But the android one wouldn't compile.
Any idea how/what to fix? Feels like a build configuration problem, because of this line in the error message.
my_project.MainActivity is defined multiple times:
I have no experience with native android development (gradle), so a few pointers would be great.
Thanks
Full error message:
Launching lib/photo_main.dart on Android SDK built for x86 in debug mode...
Running Gradle task 'assembleDebug'...
Note: /home/user/workspace/flutter/.pub-cache/hosted/pub.dartlang.org/flutter_facebook_auth-3.5.7/android/src/main/java/app/meedu/flutter_facebook_auth/FacebookAuth.java uses or overrides a deprecated API.
Note: Recompile with -Xlint:deprecation for details.
Note: /home/user/workspace/flutter/.pub-cache/hosted/pub.dartlang.org/firebase_crashlytics-2.8.0/android/src/main/java/io/flutter/plugins/firebase/crashlytics/FlutterFirebaseCrashlyticsPlugin.java uses or overrides a deprecated API.
Note: Recompile with -Xlint:deprecation for details.
Note: /home/user/workspace/flutter/.pub-cache/hosted/pub.dartlang.org/firebase_database-9.0.15/android/src/main/java/io/flutter/plugins/firebase/database/FirebaseDatabasePlugin.java uses or overrides a deprecated API.
Note: Recompile with -Xlint:deprecation for details.
Note: /home/user/workspace/flutter/.pub-cache/hosted/pub.dartlang.org/firebase_dynamic_links-4.2.5/android/src/main/java/io/flutter/plugins/firebase/dynamiclinks/FlutterFirebaseDynamicLinksPlugin.java uses unchecked or unsafe operations.
Note: Recompile with -Xlint:unchecked for details.
Note: /home/user/workspace/flutter/.pub-cache/hosted/pub.dartlang.org/firebase_messaging-11.4.0/android/src/main/java/io/flutter/plugins/firebase/messaging/JobIntentService.java uses or overrides a deprecated API.
Note: Recompile with -Xlint:deprecation for details.
Note: Some input files use or override a deprecated API.
Note: Recompile with -Xlint:deprecation for details.
/home/user/workspace/my_repo/build/app/intermediates/javac/debug/classes/myproject/best/my_project/MainActivity.class: D8: Type myproject.best.my_project.MainActivity is defined multiple times: /home/user/workspace/my_repo/build/app/intermediates/javac/debug/classes/myproject/best/my_project/MainActivity.class, /home/user/workspace/my_repo/build/app/tmp/kotlin-classes/debug/myproject/best/my_project/MainActivity.class
org.gradle.workers.WorkerExecutionException: There was a failure while executing work items
at org.gradle.workers.internal.DefaultWorkerExecutor.workerExecutionException(DefaultWorkerExecutor.java:264)
at org.gradle.workers.internal.DefaultWorkerExecutor.await(DefaultWorkerExecutor.java:246)
at com.android.build.gradle.internal.tasks.DexArchiveBuilderTaskDelegate.doProcess(DexArchiveBuilderTaskDelegate.kt:280)
at com.android.build.gradle.internal.tasks.DexArchiveBuilderTask.doTaskAction(DexArchiveBuilderTask.kt:282)
at com.android.build.gradle.internal.tasks.NewIncrementalTask$taskAction$$inlined$recordTaskAction$1.invoke(AndroidVariantTask.kt:73)
at com.android.build.gradle.internal.tasks.NewIncrementalTask$taskAction$$inlined$recordTaskAction$1.invoke(AndroidVariantTask.kt:34)
at com.android.build.gradle.internal.tasks.Blocks.recordSpan(Blocks.java:91)
at com.android.build.gradle.internal.tasks.NewIncrementalTask.taskAction(NewIncrementalTask.kt:34)
at jdk.internal.reflect.GeneratedMethodAccessor443.invoke(Unknown Source)
at java.base/jdk.internal.reflect.DelegatingMethodAccessorImpl.invoke(DelegatingMethodAccessorImpl.java:43)
at java.base/java.lang.reflect.Method.invoke(Method.java:566)
at org.gradle.internal.reflect.JavaMethod.invoke(JavaMethod.java:104)
at org.gradle.api.internal.project.taskfactory.IncrementalInputsTaskAction.doExecute(IncrementalInputsTaskAction.java:32)
at org.gradle.api.internal.project.taskfactory.StandardTaskAction.execute(StandardTaskAction.java:51)
at org.gradle.api.internal.project.taskfactory.AbstractIncrementalTaskAction.execute(AbstractIncrementalTaskAction.java:25)
at org.gradle.api.internal.project.taskfactory.StandardTaskAction.execute(StandardTaskAction.java:29)
at org.gradle.api.internal.tasks.execution.ExecuteActionsTaskExecuter$3.run(ExecuteActionsTaskExecuter.java:555)
at org.gradle.internal.operations.DefaultBuildOperationRunner$1.execute(DefaultBuildOperationRunner.java:29)
at org.gradle.internal.operations.DefaultBuildOperationRunner$1.execute(DefaultBuildOperationRunner.java:26)
at org.gradle.internal.operations.DefaultBuildOperationRunner$3.execute(DefaultBuildOperationRunner.java:75)
at org.gradle.internal.operations.DefaultBuildOperationRunner$3.execute(DefaultBuildOperationRunner.java:68)
at org.gradle.internal.operations.DefaultBuildOperationRunner.execute(DefaultBuildOperationRunner.java:153)
at org.gradle.internal.operations.DefaultBuildOperationRunner.execute(DefaultBuildOperationRunner.java:68)
at org.gradle.internal.operations.DefaultBuildOperationRunner.run(DefaultBuildOperationRunner.java:56)
at org.gradle.internal.operations.DefaultBuildOperationExecutor.lambda$run$1(DefaultBuildOperationExecutor.java:71)
at org.gradle.internal.operations.UnmanagedBuildOperationWrapper.runWithUnmanagedSupport(UnmanagedBuildOperationWrapper.java:45)
at org.gradle.internal.operations.DefaultBuildOperationExecutor.run(DefaultBuildOperationExecutor.java:71)
at org.gradle.api.internal.tasks.execution.ExecuteActionsTaskExecuter.executeAction(ExecuteActionsTaskExecuter.java:540)
at org.gradle.api.internal.tasks.execution.ExecuteActionsTaskExecuter.executeActions(ExecuteActionsTaskExecuter.java:523)
at org.gradle.api.internal.tasks.execution.ExecuteActionsTaskExecuter.access$300(ExecuteActionsTaskExecuter.java:108)
at org.gradle.api.internal.tasks.execution.ExecuteActionsTaskExecuter$TaskExecution.executeWithPreviousOutputFiles(ExecuteActionsTaskExecuter.java:271)
at org.gradle.api.internal.tasks.execution.ExecuteActionsTaskExecuter$TaskExecution.execute(ExecuteActionsTaskExecuter.java:260)
at org.gradle.internal.execution.steps.ExecuteStep.lambda$execute$0(ExecuteStep.java:33)
at java.base/java.util.Optional.map(Optional.java:265)
at org.gradle.internal.execution.steps.ExecuteStep.execute(ExecuteStep.java:33)
at org.gradle.internal.execution.steps.ExecuteStep.execute(ExecuteStep.java:26)
at org.gradle.internal.execution.steps.CleanupOutputsStep.execute(CleanupOutputsStep.java:67)
at org.gradle.internal.execution.steps.CleanupOutputsStep.execute(CleanupOutputsStep.java:36)
at org.gradle.internal.execution.steps.ResolveInputChangesStep.execute(ResolveInputChangesStep.java:49)
at org.gradle.internal.execution.steps.ResolveInputChangesStep.execute(ResolveInputChangesStep.java:34)
at org.gradle.internal.execution.steps.CancelExecutionStep.execute(CancelExecutionStep.java:43)
at org.gradle.internal.execution.steps.TimeoutStep.executeWithoutTimeout(TimeoutStep.java:73)
at org.gradle.internal.execution.steps.TimeoutStep.execute(TimeoutStep.java:54)
at org.gradle.internal.execution.steps.CreateOutputsStep.execute(CreateOutputsStep.java:44)
at org.gradle.internal.execution.steps.SnapshotOutputsStep.execute(SnapshotOutputsStep.java:54)
at org.gradle.internal.execution.steps.SnapshotOutputsStep.execute(SnapshotOutputsStep.java:38)
at org.gradle.internal.execution.steps.BroadcastChangingOutputsStep.execute(BroadcastChangingOutputsStep.java:42)
at org.gradle.internal.execution.steps.CacheStep.executeWithoutCache(CacheStep.java:159)
at org.gradle.internal.execution.steps.CacheStep.execute(CacheStep.java:72)
at org.gradle.internal.execution.steps.CacheStep.execute(CacheStep.java:43)
at org.gradle.internal.execution.steps.StoreExecutionStateStep.execute(StoreExecutionStateStep.java:44)
at org.gradle.internal.execution.steps.StoreExecutionStateStep.execute(StoreExecutionStateStep.java:33)
at org.gradle.internal.execution.steps.RecordOutputsStep.execute(RecordOutputsStep.java:38)
at org.gradle.internal.execution.steps.RecordOutputsStep.execute(RecordOutputsStep.java:24)
at org.gradle.internal.execution.steps.SkipUpToDateStep.executeBecause(SkipUpToDateStep.java:92)
at org.gradle.internal.execution.steps.SkipUpToDateStep.lambda$execute$0(SkipUpToDateStep.java:85)
at java.base/java.util.Optional.map(Optional.java:265)
at org.gradle.internal.execution.steps.SkipUpToDateStep.execute(SkipUpToDateStep.java:55)
at org.gradle.internal.execution.steps.SkipUpToDateStep.execute(SkipUpToDateStep.java:39)
at org.gradle.internal.execution.steps.ResolveChangesStep.execute(ResolveChangesStep.java:76)
at org.gradle.internal.execution.steps.ResolveChangesStep.execute(ResolveChangesStep.java:37)
at org.gradle.internal.execution.steps.legacy.MarkSnapshottingInputsFinishedStep.execute(MarkSnapshottingInputsFinishedStep.java:36)
at org.gradle.internal.execution.steps.legacy.MarkSnapshottingInputsFinishedStep.execute(MarkSnapshottingInputsFinishedStep.java:26)
at org.gradle.internal.execution.steps.ResolveCachingStateStep.execute(ResolveCachingStateStep.java:94)
at org.gradle.internal.execution.steps.ResolveCachingStateStep.execute(ResolveCachingStateStep.java:49)
at org.gradle.internal.execution.steps.CaptureStateBeforeExecutionStep.execute(CaptureStateBeforeExecutionStep.java:79)
at org.gradle.internal.execution.steps.CaptureStateBeforeExecutionStep.execute(CaptureStateBeforeExecutionStep.java:53)
at org.gradle.internal.execution.steps.ValidateStep.execute(ValidateStep.java:74)
at org.gradle.internal.execution.steps.SkipEmptyWorkStep.lambda$execute$2(SkipEmptyWorkStep.java:78)
at java.base/java.util.Optional.orElseGet(Optional.java:369)
at org.gradle.internal.execution.steps.SkipEmptyWorkStep.execute(SkipEmptyWorkStep.java:78)
at org.gradle.internal.execution.steps.SkipEmptyWorkStep.execute(SkipEmptyWorkStep.java:34)
.
.
.
.
. (omitted due to length limit)
org.gradle.internal.execution.steps.SkipUpToDateStep.execute(SkipUpToDateStep.java:55)
at org.gradle.internal.execution.steps.SkipUpToDateStep.execute(SkipUpToDateStep.java:39)
at org.gradle.internal.execution.steps.ResolveChangesStep.execute(ResolveChangesStep.java:76)
at org.gradle.internal.execution.steps.ResolveChangesStep.execute(ResolveChangesStep.java:37)
at org.gradle.internal.execution.steps.legacy.MarkSnapshottingInputsFinishedStep.execute(MarkSnapshottingInputsFinishedStep.java:36)
at org.gradle.internal.execution.steps.legacy.MarkSnapshottingInputsFinishedStep.execute(MarkSnapshottingInputsFinishedStep.java:26)
at org.gradle.internal.execution.steps.ResolveCachingStateStep.execute(ResolveCachingStateStep.java:94)
at org.gradle.internal.execution.steps.ResolveCachingStateStep.execute(ResolveCachingStateStep.java:49)
at org.gradle.internal.execution.steps.CaptureStateBeforeExecutionStep.execute(CaptureStateBeforeExecutionStep.java:79)
at org.gradle.internal.execution.steps.CaptureStateBeforeExecutionStep.execute(CaptureStateBeforeExecutionStep.java:53)
at org.gradle.internal.execution.steps.ValidateStep.execute(ValidateStep.java:74)
at org.gradle.internal.execution.steps.SkipEmptyWorkStep.lambda$execute$2(SkipEmptyWorkStep.java:78)
at java.base/java.util.Optional.orElseGet(Optional.java:369)
at org.gradle.internal.execution.steps.SkipEmptyWorkStep.execute(SkipEmptyWorkStep.java:78)
at org.gradle.internal.execution.steps.SkipEmptyWorkStep.execute(SkipEmptyWorkStep.java:34)
at org.gradle.internal.execution.steps.legacy.MarkSnapshottingInputsStartedStep.execute(MarkSnapshottingInputsStartedStep.java:39)
at org.gradle.internal.execution.steps.LoadExecutionStateStep.execute(LoadExecutionStateStep.java:40)
at org.gradle.internal.execution.steps.LoadExecutionStateStep.execute(LoadExecutionStateStep.java:28)
at org.gradle.internal.execution.impl.DefaultWorkExecutor.execute(DefaultWorkExecutor.java:33)
at org.gradle.api.internal.tasks.execution.ExecuteActionsTaskExecuter.executeIfValid(ExecuteActionsTaskExecuter.java:187)
at org.gradle.api.internal.tasks.execution.ExecuteActionsTaskExecuter.execute(ExecuteActionsTaskExecuter.java:179)
at org.gradle.api.internal.tasks.execution.CleanupStaleOutputsExecuter.execute(CleanupStaleOutputsExecuter.java:109)
at org.gradle.api.internal.tasks.execution.FinalizePropertiesTaskExecuter.execute(FinalizePropertiesTaskExecuter.java:46)
at org.gradle.api.internal.tasks.execution.ResolveTaskExecutionModeExecuter.execute(ResolveTaskExecutionModeExecuter.java:62)
at org.gradle.api.internal.tasks.execution.SkipTaskWithNoActionsExecuter.execute(SkipTaskWithNoActionsExecuter.java:57)
at org.gradle.api.internal.tasks.execution.SkipOnlyIfTaskExecuter.execute(SkipOnlyIfTaskExecuter.java:56)
at org.gradle.api.internal.tasks.execution.CatchExceptionTaskExecuter.execute(CatchExceptionTaskExecuter.java:36)
at org.gradle.api.internal.tasks.execution.EventFiringTaskExecuter$1.executeTask(EventFiringTaskExecuter.java:77)
at org.gradle.api.internal.tasks.execution.EventFiringTaskExecuter$1.call(EventFiringTaskExecuter.java:55)
at org.gradle.api.internal.tasks.execution.EventFiringTaskExecuter$1.call(EventFiringTaskExecuter.java:52)
at org.gradle.internal.operations.DefaultBuildOperationRunner$CallableBuildOperationWorker.execute(DefaultBuildOperationRunner.java:200)
at org.gradle.internal.operations.DefaultBuildOperationRunner$CallableBuildOperationWorker.execute(DefaultBuildOperationRunner.java:195)
at org.gradle.internal.operations.DefaultBuildOperationRunner$3.execute(DefaultBuildOperationRunner.java:75)
at org.gradle.internal.operations.DefaultBuildOperationRunner$3.execute(DefaultBuildOperationRunner.java:68)
at org.gradle.internal.operations.DefaultBuildOperationRunner.execute(DefaultBuildOperationRunner.java:153)
at org.gradle.internal.operations.DefaultBuildOperationRunner.execute(DefaultBuildOperationRunner.java:68)
at org.gradle.internal.operations.DefaultBuildOperationRunner.call(DefaultBuildOperationRunner.java:62)
at org.gradle.internal.operations.DefaultBuildOperationExecutor.lambda$call$2(DefaultBuildOperationExecutor.java:76)
at org.gradle.internal.operations.UnmanagedBuildOperationWrapper.callWithUnmanagedSupport(UnmanagedBuildOperationWrapper.java:54)
at org.gradle.internal.operations.DefaultBuildOperationExecutor.call(DefaultBuildOperationExecutor.java:76)
at org.gradle.api.internal.tasks.execution.EventFiringTaskExecuter.execute(EventFiringTaskExecuter.java:52)
at org.gradle.execution.plan.LocalTaskNodeExecutor.execute(LocalTaskNodeExecutor.java:41)
at org.gradle.execution.taskgraph.DefaultTaskExecutionGraph$InvokeNodeExecutorsAction.execute(DefaultTaskExecutionGraph.java:372)
at org.gradle.execution.taskgraph.DefaultTaskExecutionGraph$InvokeNodeExecutorsAction.execute(DefaultTaskExecutionGraph.java:359)
at org.gradle.execution.taskgraph.DefaultTaskExecutionGraph$BuildOperationAwareExecutionAction.execute(DefaultTaskExecutionGraph.java:352)
at org.gradle.execution.taskgraph.DefaultTaskExecutionGraph$BuildOperationAwareExecutionAction.execute(DefaultTaskExecutionGraph.java:338)
at org.gradle.execution.plan.DefaultPlanExecutor$ExecutorWorker.lambda$run$0(DefaultPlanExecutor.java:127)
at org.gradle.execution.plan.DefaultPlanExecutor$ExecutorWorker.execute(DefaultPlanExecutor.java:191)
at org.gradle.execution.plan.DefaultPlanExecutor$ExecutorWorker.executeNextNode(DefaultPlanExecutor.java:182)
at org.gradle.execution.plan.DefaultPlanExecutor$ExecutorWorker.run(DefaultPlanExecutor.java:124)
at org.gradle.internal.concurrent.ExecutorPolicy$CatchAndRecordFailures.onExecute(ExecutorPolicy.java:64)
at org.gradle.internal.concurrent.ManagedExecutorImpl$1.run(ManagedExecutorImpl.java:48)
at java.base/java.util.concurrent.ThreadPoolExecutor.runWorker(ThreadPoolExecutor.java:1128)
at java.base/java.util.concurrent.ThreadPoolExecutor$Worker.run(ThreadPoolExecutor.java:628)
at org.gradle.internal.concurrent.ThreadFactoryImpl$ManagedThreadRunnable.run(ThreadFactoryImpl.java:56)
at java.base/java.lang.Thread.run(Thread.java:829)
Caused by: org.gradle.tooling.BuildException: Failed to process: /home/user/workspace/my_repo/build/app/intermediates/javac/debug/classes, /home/user/workspace/my_repo/build/app/tmp/kotlin-classes/debug
at com.android.build.gradle.internal.dexing.DexWorkAction.run(DexWorkAction.kt:59)
at org.gradle.workers.internal.AdapterWorkAction.execute(AdapterWorkAction.java:57)
at org.gradle.workers.internal.DefaultWorkerServer.execute(DefaultWorkerServer.java:63)
at org.gradle.workers.internal.NoIsolationWorkerFactory$1$1.create(NoIsolationWorkerFactory.java:67)
at org.gradle.workers.internal.NoIsolationWorkerFactory$1$1.create(NoIsolationWorkerFactory.java:63)
at org.gradle.internal.classloader.ClassLoaderUtils.executeInClassloader(ClassLoaderUtils.java:97)
at org.gradle.workers.internal.NoIsolationWorkerFactory$1.lambda$execute$0(NoIsolationWorkerFactory.java:63)
at org.gradle.workers.internal.AbstractWorker$1.call(AbstractWorker.java:44)
at org.gradle.workers.internal.AbstractWorker$1.call(AbstractWorker.java:41)
at org.gradle.internal.operations.DefaultBuildOperationRunner$CallableBuildOperationWorker.execute(DefaultBuildOperationRunner.java:200)
at org.gradle.internal.operations.DefaultBuildOperationRunner$CallableBuildOperationWorker.execute(DefaultBuildOperationRunner.java:195)
at org.gradle.internal.operations.DefaultBuildOperationRunner$3.execute(DefaultBuildOperationRunner.java:75)
at org.gradle.internal.operations.DefaultBuildOperationRunner$3.execute(DefaultBuildOperationRunner.java:68)
at org.gradle.internal.operations.DefaultBuildOperationRunner.execute(DefaultBuildOperationRunner.java:153)
at org.gradle.internal.operations.DefaultBuildOperationRunner.execute(DefaultBuildOperationRunner.java:68)
at org.gradle.internal.operations.DefaultBuildOperationRunner.call(DefaultBuildOperationRunner.java:62)
at org.gradle.internal.operations.DefaultBuildOperationExecutor.lambda$call$2(DefaultBuildOperationExecutor.java:76)
at org.gradle.internal.operations.UnmanagedBuildOperationWrapper.callWithUnmanagedSupport(UnmanagedBuildOperationWrapper.java:54)
at org.gradle.internal.operations.DefaultBuildOperationExecutor.call(DefaultBuildOperationExecutor.java:76)
at org.gradle.workers.internal.AbstractWorker.executeWrappedInBuildOperation(AbstractWorker.java:41)
at org.gradle.workers.internal.NoIsolationWorkerFactory$1.execute(NoIsolationWorkerFactory.java:60)
at org.gradle.workers.internal.DefaultWorkerExecutor.lambda$submitWork$2(DefaultWorkerExecutor.java:200)
at java.base/java.util.concurrent.FutureTask.run(FutureTask.java:264)
at org.gradle.internal.work.DefaultConditionalExecutionQueue$ExecutionRunner.runExecution(DefaultConditionalExecutionQueue.java:215)
at org.gradle.internal.work.DefaultConditionalExecutionQueue$ExecutionRunner.runBatch(DefaultConditionalExecutionQueue.java:164)
at org.gradle.internal.work.DefaultConditionalExecutionQueue$ExecutionRunner.run(DefaultConditionalExecutionQueue.java:131)
at java.base/java.util.concurrent.Executors$RunnableAdapter.call(Executors.java:515)
at java.base/java.util.concurrent.FutureTask.run(FutureTask.java:264)
... 6 more
Caused by: com.android.builder.dexing.DexArchiveBuilderException: Failed to process: /home/user/workspace/my_repo/build/app/intermediates/javac/debug/classes, /home/user/workspace/my_repo/build/app/tmp/kotlin-classes/debug
at com.android.build.gradle.internal.dexing.DexWorkActionKt.process(DexWorkAction.kt:198)
at com.android.build.gradle.internal.dexing.DexWorkActionKt.processNonIncrementally(DexWorkAction.kt:164)
at com.android.build.gradle.internal.dexing.DexWorkActionKt.launchProcessing(DexWorkAction.kt:91)
at com.android.build.gradle.internal.dexing.DexWorkAction.run(DexWorkAction.kt:49)
... 33 more
Caused by: com.android.builder.dexing.DexArchiveBuilderException: Error while dexing.
at com.android.builder.dexing.D8DexArchiveBuilder.getExceptionToRethrow(D8DexArchiveBuilder.java:141)
at com.android.builder.dexing.D8DexArchiveBuilder.convert(D8DexArchiveBuilder.java:118)
at com.android.build.gradle.internal.dexing.DexWorkActionKt.process(DexWorkAction.kt:194)
... 36 more
Caused by: com.android.tools.r8.CompilationFailedException: Compilation failed to complete, origin: /home/user/workspace/my_repo/build/app/intermediates/javac/debug/classes/myproject/best/my_project/MainActivity.class
at Version.fakeStackEntry(Version_2.1.62.java:0)
at com.android.tools.r8.utils.Y.a(SourceFile:78)
at com.android.tools.r8.D8.run(D8.java:11)
at com.android.builder.dexing.D8DexArchiveBuilder.convert(D8DexArchiveBuilder.java:116)
... 37 more
Caused by: com.android.tools.r8.utils.b: Type myproject.best.my_project.MainActivity is defined multiple times: /home/user/workspace/my_repo/build/app/intermediates/javac/debug/classes/myproject/best/my_project/MainActivity.class, /home/user/workspace/my_repo/build/app/tmp/kotlin-classes/debug/myproject/best/my_project/MainActivity.class
at com.android.tools.r8.utils.T0.error(SourceFile:1)
at com.android.tools.r8.utils.T0.a(SourceFile:2)
at com.android.tools.r8.utils.R0.b(SourceFile:6)
at com.android.tools.r8.utils.R0.a(SourceFile:24)
at com.android.tools.r8.utils.R0.a(SourceFile:10)
at java.base/java.util.concurrent.ConcurrentHashMap.merge(ConcurrentHashMap.java:2048)
at com.android.tools.r8.utils.R0.a(SourceFile:6)
at com.android.tools.r8.graph.O0$c.f(SourceFile:3)
at com.android.tools.r8.dex.a.a(SourceFile:294)
at com.android.tools.r8.dex.a.a(SourceFile:222)
at com.android.tools.r8.D8.d(D8.java:6)
at com.android.tools.r8.D8.b(D8.java:1)
at com.android.tools.r8.utils.Y.a(SourceFile:36)
... 39 more
FAILURE: Build failed with an exception.
* What went wrong:
Execution failed for task ':app:dexBuilderDebug'.
> There was a failure while executing work items
> A failure occurred while executing com.android.build.gradle.internal.dexing.DexWorkAction
> Failed to process: /home/user/workspace/my_repo/build/app/intermediates/javac/debug/classes, /home/user/workspace/my_repo/build/app/tmp/kotlin-classes/debug
* Try:
Run with --stacktrace option to get the stack trace. Run with --info or --debug option to get more log output. Run with --scan to get full insights.
* Get more help at https://help.gradle.org
BUILD FAILED in 2m 7s
┌─ Flutter Fix ──────────────────────────────────────────────────────────────┐
│ [!] The shrinker may have failed to optimize the Java bytecode. │
│ To disable the shrinker, pass the `--no-shrink` flag to this command. │
│ To learn more, see: https://developer.android.com/studio/build/shrink-code │
└────────────────────────────────────────────────────────────────────────────┘
Exception: Gradle task assembleDebug failed with exit code 1
Here's the flutter doctor
flutter doctor
Doctor summary (to see all details, run flutter doctor -v):
[✓] Flutter (Channel stable, 3.0.1, on Ubuntu 20.04.4 LTS 5.13.0-44-generic, locale en_US.UTF-8)
[✓] Android toolchain - develop for Android devices (Android SDK version 32.1.0-rc1)
[✓] Chrome - develop for the web
[✗] Linux toolchain - develop for Linux desktop
✗ clang++ is required for Linux development.
It is likely available from your distribution (e.g.: apt install clang), or can be downloaded from https://releases.llvm.org/
✗ ninja is required for Linux development.
It is likely available from your distribution (e.g.: apt install ninja-build), or can be downloaded from https://github.com/ninja-build/ninja/releases
✗ GTK 3.0 development libraries are required for Linux development.
They are likely available from your distribution (e.g.: apt install libgtk-3-dev)
[✓] Android Studio (version 2021.1)
[✓] Android Studio (version 2021.2)
[✓] Connected device (3 available)
[✓] HTTP Host Availability
! Doctor found issues in 1 category.