I just moved to a Mac device, and a flutter project that can run on Windows 10, but when I try to go on the Macbook,
the debug console displays an error like this, please help, thank you.
FAILURE: Build failed with an exception.
What went wrong:
Execution failed for task ':app:compileFlutterBuildDebug'.
> java.net.URISyntaxException: Illegal character in opaque part at index 2: G:\\2. KoffieSoft\\Referensi\\fix\\Operasional\\mjw_operasional\\android\\app\\build\\intermediates\\flutter\\debug\\flutter_assets\\AssetManifest.json
Try:
> Run with --stacktrace option to get the stack trace.
> Run with --info or --debug option to get more log output.
> Run with --scan to get full insights.
Get more help at https://help.gradle.org
BUILD FAILED in 4s
Exception: Gradle task assembleDebug failed with exit code 1
Exited (sigterm)