FAILURE: Build failed with an exception.
- What went wrong: A problem occurred configuring root project 'android'.
Failed to create Jar file C:\Users\Mahjur - Coding.gradle\caches\jars-8\ec50ce4709fd95f8ed96c3a048d9b515\databinding-compiler-common-4.1.0.jar.
Try: Run with --stacktrace option to get the stack trace. Run with --info or --debug option to get more log output. Run with --scan to get full insights.
Get more help at https://help.gradle.org
BUILD FAILED in 1s Exception: Gradle task assembleDebug failed with exit code 1
Hello all, every time I try to run my code, I am getting this error. Others I know are able to run this just fine, It seems that I'm the only one dealing with this issue. Any solution? I am new to this all, so please be detailed when giving any explanations.