In Linux, installation of perl is failing while running make test command
t/op/exec ...................................................... # Failed test 17 - at op/exec.t line 114
# $! eq 40, 'Too many levels of symbolic links'
FAILED at test 17
Error is not indicating for which symbolic link it is failing.
Steps Followed:
- Download perl archive from https://www.cpan.org/src/
- [user@hostname perl-5.28.3]$ tar -xvzf perl-5.28.3.tar.gz
- [user@hostname perl-5.28.3]$ cd perl-5.28.3
- [user@hostname perl-5.28.3]$ ./Configure -des -Dinstallprefix=<installation directory>
- [user@hostname perl-5.28.3]$ make
- [user@hostname perl-5.28.3]$ make test
Failed 2 tests out of 2464, 99.92% okay.
../cpan/Time-Local/t/Local.t
op/exec.t
Elapsed: 1317 sec
u=12.87 s=34.02 cu=548.85 cs=488.76 scripts=2464 tests=1158447
make: *** [test] Error 1
[user@hostname perl-5.28.3]$ t/TEST op/exec.t
t/op/exec ... # Failed test 17 - at op/exec.t line 114
# $! eq 40, 'Too many levels of symbolic links'
FAILED at test 17
Failed 1 test out of 1, 0.00% okay.
op/exec.t
Verified same behavior is happening for other perl version also, this is indicating some issue with my installation environment.
Any pointer can be helpful.