I am trying to install Zeppelin (https://github.com/apache/zeppelin) on my virtual machine, Since docker is not supported on my VM, I had do all the setup manually, I had process failure when i tried running "bin/zeppelin-daemon.sh start" mentioned in document. Hence modified, mvn install command to bellow command to reduce some of dependency errors.
mvn clean install -Denforcer.skip=true -X -e -DskipTests -Dlicense.skip -Drat.numUnapprovedLicenses=100
still facing issue with zeppelin-web package to be installed. its gives an error which says "zeppelin-web: Failed to run task: 'npm install --no-lockfile' failed" i have attached logs bellow for reference.
I tried adding npmrc file and set package-lock to false and also tried config manually still getting same errors.
[INFO] Zeppelin: web Application .......................... FAILURE [03:00 min]
[INFO] Zeppelin: Server ................................... SKIPPED
[INFO] Zeppelin: Plugins Parent ........................... SKIPPED
[INFO] Zeppelin: Plugin S3NotebookRepo .................... SKIPPED
[INFO] Zeppelin: Plugin GitHubNotebookRepo ................ SKIPPED
[INFO] Zeppelin: Plugin AzureNotebookRepo ................. SKIPPED
[INFO] Zeppelin: Plugin GCSNotebookRepo ................... SKIPPED
[INFO] Zeppelin: Plugin FileSystemNotebookRepo ............ SKIPPED
[INFO] Zeppelin: Plugin MongoNotebookRepo ................. SKIPPED
[INFO] Zeppelin: Plugin OSSNotebookRepo ................... SKIPPED
[INFO] Zeppelin: Plugin Kubernetes StandardLauncher ....... SKIPPED
[INFO] Zeppelin: Plugin Flink Launcher .................... SKIPPED
[INFO] Zeppelin: Plugin Docker Launcher ................... SKIPPED
[INFO] Zeppelin: Plugin Cluster Launcher .................. SKIPPED
[INFO] Zeppelin: Plugin Yarn Launcher ..................... SKIPPED
[INFO] Zeppelin: Packaging distribution ................... SKIPPED
[INFO] ------------------------------------------------------------------------
[INFO] BUILD FAILURE
[INFO] ------------------------------------------------------------------------
[INFO] Total time: 43:10 min
[INFO] Finished at: 2022-02-01T16:28:17+05:30
[INFO] ------------------------------------------------------------------------
[ERROR] Failed to execute goal com.github.eirslett:frontend-maven-plugin:1.6:npm (npm install) on project zeppelin-web: Failed to run task: 'npm install --no-lockfile' failed. org.apache.commons.exec.ExecuteException: Process exited with an error: 1 (Exit value: 1) -> [Help 1]
org.apache.maven.lifecycle.LifecycleExecutionException: Failed to execute goal com.github.eirslett:frontend-maven-plugin:1.6:npm (npm install) on project zeppelin-web: Failed to run task
at org.apache.maven.lifecycle.internal.MojoExecutor.execute (MojoExecutor.java:215)
at org.apache.maven.lifecycle.internal.MojoExecutor.execute (MojoExecutor.java:156)
at org.apache.maven.lifecycle.internal.MojoExecutor.execute (MojoExecutor.java:148)
at org.apache.maven.lifecycle.internal.LifecycleModuleBuilder.buildProject (LifecycleModuleBuilder.java:117)
at org.apache.maven.lifecycle.internal.LifecycleModuleBuilder.buildProject (LifecycleModuleBuilder.java:81)
at org.apache.maven.lifecycle.internal.builder.singlethreaded.SingleThreadedBuilder.build (SingleThreadedBuilder.java:56)
at org.apache.maven.lifecycle.internal.LifecycleStarter.execute (LifecycleStarter.java:128)
at org.apache.maven.DefaultMaven.doExecute (DefaultMaven.java:305)
at org.apache.maven.DefaultMaven.doExecute (DefaultMaven.java:192)
at org.apache.maven.DefaultMaven.execute (DefaultMaven.java:105)
at org.apache.maven.cli.MavenCli.execute (MavenCli.java:972)
at org.apache.maven.cli.MavenCli.doMain (MavenCli.java:293)
at org.apache.maven.cli.MavenCli.main (MavenCli.java:196)
at sun.reflect.NativeMethodAccessorImpl.invoke0 (Native Method)
at sun.reflect.NativeMethodAccessorImpl.invoke (NativeMethodAccessorImpl.java:62)
at sun.reflect.DelegatingMethodAccessorImpl.invoke (DelegatingMethodAccessorImpl.java:43)
at java.lang.reflect.Method.invoke (Method.java:498)
at org.codehaus.plexus.classworlds.launcher.Launcher.launchEnhanced (Launcher.java:282)
at org.codehaus.plexus.classworlds.launcher.Launcher.launch (Launcher.java:225)
at org.codehaus.plexus.classworlds.launcher.Launcher.mainWithExitCode (Launcher.java:406)
at org.codehaus.plexus.classworlds.launcher.Launcher.main (Launcher.java:347)
Caused by: org.apache.maven.plugin.MojoFailureException: Failed to run task
at com.github.eirslett.maven.plugins.frontend.mojo.AbstractFrontendMojo.execute (AbstractFrontendMojo.java:100)
at org.apache.maven.plugin.DefaultBuildPluginManager.executeMojo (DefaultBuildPluginManager.java:137)
at org.apache.maven.lifecycle.internal.MojoExecutor.execute (MojoExecutor.java:210)
at org.apache.maven.lifecycle.internal.MojoExecutor.execute (MojoExecutor.java:156)
at org.apache.maven.lifecycle.internal.MojoExecutor.execute (MojoExecutor.java:148)
at org.apache.maven.lifecycle.internal.LifecycleModuleBuilder.buildProject (LifecycleModuleBuilder.java:117)
at org.apache.maven.lifecycle.internal.LifecycleModuleBuilder.buildProject (LifecycleModuleBuilder.java:81)
at org.apache.maven.lifecycle.internal.builder.singlethreaded.SingleThreadedBuilder.build (SingleThreadedBuilder.java:56)
at org.apache.maven.lifecycle.internal.LifecycleStarter.execute (LifecycleStarter.java:128)
at org.apache.maven.DefaultMaven.doExecute (DefaultMaven.java:305)
at org.apache.maven.DefaultMaven.doExecute (DefaultMaven.java:192)
at org.apache.maven.DefaultMaven.execute (DefaultMaven.java:105)
at org.apache.maven.cli.MavenCli.execute (MavenCli.java:972)
at org.apache.maven.cli.MavenCli.doMain (MavenCli.java:293)
at org.apache.maven.cli.MavenCli.main (MavenCli.java:196)
at sun.reflect.NativeMethodAccessorImpl.invoke0 (Native Method)
at sun.reflect.NativeMethodAccessorImpl.invoke (NativeMethodAccessorImpl.java:62)
at sun.reflect.DelegatingMethodAccessorImpl.invoke (DelegatingMethodAccessorImpl.java:43)
at java.lang.reflect.Method.invoke (Method.java:498)
at org.codehaus.plexus.classworlds.launcher.Launcher.launchEnhanced (Launcher.java:282)
at org.codehaus.plexus.classworlds.launcher.Launcher.launch (Launcher.java:225)
at org.codehaus.plexus.classworlds.launcher.Launcher.mainWithExitCode (Launcher.java:406)
at org.codehaus.plexus.classworlds.launcher.Launcher.main (Launcher.java:347)
Caused by: com.github.eirslett.maven.plugins.frontend.lib.TaskRunnerException: 'npm install --no-lockfile' failed.
at com.github.eirslett.maven.plugins.frontend.lib.NodeTaskExecutor.execute (NodeTaskExecutor.java:63)
at com.github.eirslett.maven.plugins.frontend.mojo.NpmMojo.execute (NpmMojo.java:62)
at com.github.eirslett.maven.plugins.frontend.mojo.AbstractFrontendMojo.execute (AbstractFrontendMojo.java:94)
at org.apache.maven.plugin.DefaultBuildPluginManager.executeMojo (DefaultBuildPluginManager.java:137)
at org.apache.maven.lifecycle.internal.MojoExecutor.execute (MojoExecutor.java:210)
at org.apache.maven.lifecycle.internal.MojoExecutor.execute (MojoExecutor.java:156)
at org.apache.maven.lifecycle.internal.MojoExecutor.execute (MojoExecutor.java:148)
at org.apache.maven.lifecycle.internal.LifecycleModuleBuilder.buildProject (LifecycleModuleBuilder.java:117)
at org.apache.maven.lifecycle.internal.LifecycleModuleBuilder.buildProject (LifecycleModuleBuilder.java:81)
at org.apache.maven.lifecycle.internal.builder.singlethreaded.SingleThreadedBuilder.build (SingleThreadedBuilder.java:56)
at org.apache.maven.lifecycle.internal.LifecycleStarter.execute (LifecycleStarter.java:128)
at org.apache.maven.DefaultMaven.doExecute (DefaultMaven.java:305)
at org.apache.maven.DefaultMaven.doExecute (DefaultMaven.java:192)
at org.apache.maven.DefaultMaven.execute (DefaultMaven.java:105)
at org.apache.maven.cli.MavenCli.execute (MavenCli.java:972)
at org.apache.maven.cli.MavenCli.doMain (MavenCli.java:293)
at org.apache.maven.cli.MavenCli.main (MavenCli.java:196)
at sun.reflect.NativeMethodAccessorImpl.invoke0 (Native Method)
at sun.reflect.NativeMethodAccessorImpl.invoke (NativeMethodAccessorImpl.java:62)
at sun.reflect.DelegatingMethodAccessorImpl.invoke (DelegatingMethodAccessorImpl.java:43)
at java.lang.reflect.Method.invoke (Method.java:498)
at org.codehaus.plexus.classworlds.launcher.Launcher.launchEnhanced (Launcher.java:282)
at org.codehaus.plexus.classworlds.launcher.Launcher.launch (Launcher.java:225)
at org.codehaus.plexus.classworlds.launcher.Launcher.mainWithExitCode (Launcher.java:406)
at org.codehaus.plexus.classworlds.launcher.Launcher.main (Launcher.java:347)
Caused by: com.github.eirslett.maven.plugins.frontend.lib.ProcessExecutionException: org.apache.commons.exec.ExecuteException: Process exited with an error: 1 (Exit value: 1)
at com.github.eirslett.maven.plugins.frontend.lib.ProcessExecutor.execute (ProcessExecutor.java:82)
at com.github.eirslett.maven.plugins.frontend.lib.ProcessExecutor.executeAndRedirectOutput (ProcessExecutor.java:64)
at com.github.eirslett.maven.plugins.frontend.lib.NodeExecutor.executeAndRedirectOutput (NodeExecutor.java:29)
at com.github.eirslett.maven.plugins.frontend.lib.NodeTaskExecutor.execute (NodeTaskExecutor.java:58)
at com.github.eirslett.maven.plugins.frontend.mojo.NpmMojo.execute (NpmMojo.java:62)
at com.github.eirslett.maven.plugins.frontend.mojo.AbstractFrontendMojo.execute (AbstractFrontendMojo.java:94)
at org.apache.maven.plugin.DefaultBuildPluginManager.executeMojo (DefaultBuildPluginManager.java:137)
at org.apache.maven.lifecycle.internal.MojoExecutor.execute (MojoExecutor.java:210)
at org.apache.maven.lifecycle.internal.MojoExecutor.execute (MojoExecutor.java:156)
at org.apache.maven.lifecycle.internal.MojoExecutor.execute (MojoExecutor.java:148)
at org.apache.maven.lifecycle.internal.LifecycleModuleBuilder.buildProject (LifecycleModuleBuilder.java:117)
at org.apache.maven.lifecycle.internal.LifecycleModuleBuilder.buildProject (LifecycleModuleBuilder.java:81)
at org.apache.maven.lifecycle.internal.builder.singlethreaded.SingleThreadedBuilder.build (SingleThreadedBuilder.java:56)
at org.apache.maven.lifecycle.internal.LifecycleStarter.execute (LifecycleStarter.java:128)
at org.apache.maven.DefaultMaven.doExecute (DefaultMaven.java:305)
at org.apache.maven.DefaultMaven.doExecute (DefaultMaven.java:192)
at org.apache.maven.DefaultMaven.execute (DefaultMaven.java:105)
at org.apache.maven.cli.MavenCli.execute (MavenCli.java:972)
at org.apache.maven.cli.MavenCli.doMain (MavenCli.java:293)
at org.apache.maven.cli.MavenCli.main (MavenCli.java:196)
at sun.reflect.NativeMethodAccessorImpl.invoke0 (Native Method)
at sun.reflect.NativeMethodAccessorImpl.invoke (NativeMethodAccessorImpl.java:62)
at sun.reflect.DelegatingMethodAccessorImpl.invoke (DelegatingMethodAccessorImpl.java:43)
at java.lang.reflect.Method.invoke (Method.java:498)
at org.codehaus.plexus.classworlds.launcher.Launcher.launchEnhanced (Launcher.java:282)
at org.codehaus.plexus.classworlds.launcher.Launcher.launch (Launcher.java:225)
at org.codehaus.plexus.classworlds.launcher.Launcher.mainWithExitCode (Launcher.java:406)
at org.codehaus.plexus.classworlds.launcher.Launcher.main (Launcher.java:347)
Caused by: org.apache.commons.exec.ExecuteException: Process exited with an error: 1 (Exit value: 1)
at org.apache.commons.exec.DefaultExecutor.executeInternal (DefaultExecutor.java:404)
at org.apache.commons.exec.DefaultExecutor.execute (DefaultExecutor.java:166)
at com.github.eirslett.maven.plugins.frontend.lib.ProcessExecutor.execute (ProcessExecutor.java:74)
at com.github.eirslett.maven.plugins.frontend.lib.ProcessExecutor.executeAndRedirectOutput (ProcessExecutor.java:64)
at com.github.eirslett.maven.plugins.frontend.lib.NodeExecutor.executeAndRedirectOutput (NodeExecutor.java:29)
at com.github.eirslett.maven.plugins.frontend.lib.NodeTaskExecutor.execute (NodeTaskExecutor.java:58)
at com.github.eirslett.maven.plugins.frontend.mojo.NpmMojo.execute (NpmMojo.java:62)
at com.github.eirslett.maven.plugins.frontend.mojo.AbstractFrontendMojo.execute (AbstractFrontendMojo.java:94)
at org.apache.maven.plugin.DefaultBuildPluginManager.executeMojo (DefaultBuildPluginManager.java:137)
at org.apache.maven.lifecycle.internal.MojoExecutor.execute (MojoExecutor.java:210)
at org.apache.maven.lifecycle.internal.MojoExecutor.execute (MojoExecutor.java:156)
at org.apache.maven.lifecycle.internal.MojoExecutor.execute (MojoExecutor.java:148)
at org.apache.maven.lifecycle.internal.LifecycleModuleBuilder.buildProject (LifecycleModuleBuilder.java:117)
at org.apache.maven.lifecycle.internal.LifecycleModuleBuilder.buildProject (LifecycleModuleBuilder.java:81)
at org.apache.maven.lifecycle.internal.builder.singlethreaded.SingleThreadedBuilder.build (SingleThreadedBuilder.java:56)
at org.apache.maven.lifecycle.internal.LifecycleStarter.execute (LifecycleStarter.java:128)
at org.apache.maven.DefaultMaven.doExecute (DefaultMaven.java:305)
at org.apache.maven.DefaultMaven.doExecute (DefaultMaven.java:192)
at org.apache.maven.DefaultMaven.execute (DefaultMaven.java:105)
at org.apache.maven.cli.MavenCli.execute (MavenCli.java:972)
at org.apache.maven.cli.MavenCli.doMain (MavenCli.java:293)
at org.apache.maven.cli.MavenCli.main (MavenCli.java:196)
at sun.reflect.NativeMethodAccessorImpl.invoke0 (Native Method)
at sun.reflect.NativeMethodAccessorImpl.invoke (NativeMethodAccessorImpl.java:62)
at sun.reflect.DelegatingMethodAccessorImpl.invoke (DelegatingMethodAccessorImpl.java:43)
at java.lang.reflect.Method.invoke (Method.java:498)
at org.codehaus.plexus.classworlds.launcher.Launcher.launchEnhanced (Launcher.java:282)
at org.codehaus.plexus.classworlds.launcher.Launcher.launch (Launcher.java:225)
at org.codehaus.plexus.classworlds.launcher.Launcher.mainWithExitCode (Launcher.java:406)
at org.codehaus.plexus.classworlds.launcher.Launcher.main (Launcher.java:347)
[ERROR]
[ERROR]
[ERROR] For more information about the errors and possible solutions, please read the following articles:
[ERROR] [Help 1] http://cwiki.apache.org/confluence/display/MAVEN/MojoFailureException
[ERROR]
[ERROR] After correcting the problems, you can resume the build with the command
[ERROR] mvn <args> -rf :zeppelin-web