how to resolve this Task :app:processDebugMainManifest FAILED problem when run react-native run-android command
Task :app:processDebugMainManifest FAILED
Deprecated Gradle features were used in this build, making it incompatible with Gradle 8.0.
You can use '--warning-mode all' to show the individual deprecation warnings and determine if they come from your own scripts or plugins.
See https://docs.gradle.org/7.2/userguide/command_line_interface.html#sec:command_line_warnings 18 actionable tasks: 2 executed, 16 up-to-date
FAILURE: Build failed with an exception.
- What went wrong: Execution failed for task ':app:processDebugMainManifest'.
Unable to make field private final java.lang.String java.io.File.path accessible: module java.base does not "opens java.io" to unnamed module @199cea42
Try: Run with --stacktrace option to get the stack trace. Run with --info or --debug option to get more log output. Run with --scan to get full insights.
Get more help at https://help.gradle.org
BUILD FAILED in 4s
error Failed to install the app. Make sure you have the Android development environment set up: https://reactnative.dev/docs/environment-setup. Error: Command failed: gradlew.bat app:installDebug -PreactNativeDevServerPort=8081
FAILURE: Build failed with an exception.
- What went wrong: Execution failed for task ':app:processDebugMainManifest'.
Unable to make field private final java.lang.String java.io.File.path accessible: module java.base does not "opens java.io" to unnamed module @199cea42
Try: Run with --stacktrace option to get the stack trace. Run with --info or --debug option to get more log output. Run with --scan to get full insights.
Get more help at https://help.gradle.org
BUILD FAILED in 4s
at makeError (E:\react-native\app\node_modules\execa\index.js:174:9)
at E:\react-native\app\node_modules\execa\index.js:278:16
at processTicksAndRejections (internal/process/task_queues.js:93:5)
at async runOnAllDevices (E:\react-native\app\node_modules\@react-native-community\cli-platform-android\build\commands\runAndroid\runOnAllDevices.js:106:5)
at async Command.handleAction (E:\react-native\app\node_modules\react-native\node_modules\@react-native-community\cli\build\index.js:186:9)
info Run CLI with --verbose flag for more details.