FAILURE: Build failed with an exception.
- What went wrong: Execution failed for task ':path_provider:compileDebugJavaWithJavac'.
java.lang.IllegalAccessError: class org.gradle.internal.compiler.java.ClassNameCollector (in unnamed module @0x5b8bd3a7) cannot access class com.sun.tools.javac.code.Symbol$TypeSymbol (in module jdk.compiler) because module jdk.compiler does not export com.sun.tools.javac.code to unnamed module @0x5b8bd3a7
Try: Run with --stacktrace option to get the stack trace. Run with --info or --debug option to get more log output. Run with --scan to get full insights.
Get more help at https://help.gradle.org
BUILD FAILED in 12s Exception: Gradle task assembleDebug failed with exit code 1