I'm trying to get more useful output from pytest -tb=no short output. I have integration tests stored in JSON files, so the output all looks extremely similar.
tests/test_dit_cli.py .......F............................. [ 29%]
...F...F.FF........F............................F...FFFFFFF [ 75%]
FFF.F..................F.....FF [100%]
===================== short test summary info =====================
FAILED tests/test_dit_cli.py::test_dits[dit_json7] - assert "Lin...
FAILED tests/test_dit_cli.py::test_dits[dit_json40] - assert "Li...
FAILED tests/test_dit_cli.py::test_dits[dit_json44] - assert "Li...
FAILED tests/test_dit_cli.py::test_dits[dit_json46] - assert "Li...
FAILED tests/test_dit_cli.py::test_dits[dit_json47] - assert "Li...
FAILED tests/test_dit_cli.py::test_dits[dit_json56] - assert "Li...
FAILED tests/test_dit_cli.py::test_dits[dit_json85] - assert "Li...
FAILED tests/test_dit_cli.py::test_dits[dit_json89] - AssertionE...
FAILED tests/test_dit_cli.py::test_dits[dit_json90] - AssertionE...
FAILED tests/test_dit_cli.py::test_dits[dit_json91] - AssertionE...
FAILED tests/test_dit_cli.py::test_dits[dit_json92] - AssertionE...
FAILED tests/test_dit_cli.py::test_dits[dit_json93] - AssertionE...
FAILED tests/test_dit_cli.py::test_dits[dit_json94] - AssertionE...
FAILED tests/test_dit_cli.py::test_dits[dit_json95] - AssertionE...
FAILED tests/test_dit_cli.py::test_dits[dit_json96] - assert 'Li...
FAILED tests/test_dit_cli.py::test_dits[dit_json97] - assert 'Li...
FAILED tests/test_dit_cli.py::test_dits[dit_json98] - assert "Li...
FAILED tests/test_dit_cli.py::test_dits[dit_json100] - Assertion...
FAILED tests/test_dit_cli.py::test_dits[dit_json119] - assert "L...
FAILED tests/test_dit_cli.py::test_dits[dit_json125] - Assertion...
FAILED tests/test_dit_cli.py::test_dits[dit_json126] - Assertion...
================= 21 failed, 106 passed in 2.94s ==================
Seeing this same tests/test_dit_cli.py::test_dits[dit_json126] 20 times doesn't help me get a gauge on what's going wrong in the project, so I usually just fix errors one test at a time. Each test entry has extra information about the type of test being run and the expected outcome, but I don't know how to get that information into pytest. I would hope for something like this:
===================== short test summary info =====================
FAILED [func, vanilla Python] - assert "Li...
FAILED [Thing, value assignment] - assert "Li...
FAILED [TypeMismatch, String var assigned to List] - assert "Lin...
I actually got close to this, by providing a value for ids in the parametrize call.
def pytest_generate_tests(metafunc: Metafunc):
for fixture in metafunc.fixturenames:
if fixture == "dit_json":
test_dicts = list(load_from_json())
titles = [test_dict["title"] for test_dict in test_dicts]
metafunc.parametrize(argnames=fixture, argvalues=test_dicts, ids=titles)
FAILED tests/test_dit_cli.py::test_dits[TypeMismatch, List var assigned to String]
FAILED tests/test_dit_cli.py::test_dits[import, anon import referenced in list assignment]
So, I'm really close, I just want to remove the filepath, so that the line is shorter. Is there a way to change the filepath of where it thinks the tests are located? Or a hook that would let me arbitrarily modify the summary output? I tried modifying pytest_collection_modifyitems and changing item.fspath, but it didn't change anything in the output. I've seen ways to modify lots of other things about the output, but nothing regarding specifically that filepath.