I'm running to issue installing Ruby 2.0.0 on a new macbook with macOS Catalina (version 10.15.7). At first I installed Ruby with rvm which did not work. I figured out that it was because Catalina's default terminal is ZSH instead of Bash (https://gorails.com/setup/osx/10.15-catalina). I was able to install Ruby 2.6.3 with the instructions but the issue is that the project I'm currently working on was written in Ruby 2.0.0. I tried installing this version with rbenv install 2.0.0-p0 but I ran to the following errors:
ruby-build: using libyaml from homebrew
Downloading openssl-1.0.2u.tar.gz...
-> https://dqw8nmjcqpjn7.cloudfront.net/ecd0c6ffb493dd06707d38b14bb4d8c2288bb7033735606569d8f90f89669d16
Installing openssl-1.0.2u...
Installed openssl-1.0.2u to /Users/vydoan/.rbenv/versions/2.0.0-p0
Downloading ruby-2.0.0-p0.tar.bz2...
-> https://cache.ruby-lang.org/pub/ruby/2.0/ruby-2.0.0-p0.tar.bz2
Installing ruby-2.0.0-p0...
WARNING: ruby-2.0.0-p0 is past its end of life and is now unsupported.
It no longer receives bug fixes or critical security updates.
ruby-build: using readline from homebrew
BUILD FAILED (Mac OS X 10.15.7 using ruby-build 20201005)
Inspect or clean up the working tree at /var/folders/m4/3k5xfdwx7x7gqkzzlyrlc_gc0000gn/T/ruby-build.20201006082731.4615.0q3Cat
Results logged to /var/folders/m4/3k5xfdwx7x7gqkzzlyrlc_gc0000gn/T/ruby-build.20201006082731.4615.log
Last 10 log lines:
compiling cont.c
compiling ./enc/ascii.c
thread.c:928:27: error: implicit conversion loses integer precision: 'long' to '__darwin_suseconds_t' (aka 'int') [-Werror,-Wshorten-64-to-32]
tp->tv_usec = ts.tv_nsec / 1000;
~ ~~~~~~~~~~~^~~~~~
compiling ./enc/us_ascii.c
1 error generated.
make: *** [thread.o] Error 1
make: *** Waiting for unfinished jobs....
1 warning generated.
I've tried doing the follow:
1.
brew tap homebrew/dupes
which gives me this error log
Error: homebrew/dupes was deprecated. This tap is now empty and all its contents were either deleted or migrated.
brew install gcc
rbenv install 2.0.0-p0
which gives me the same errors as above.
I've asked my team and found that another person also have issue with installing ruby on their new mac machines. The older mac didn't not have this problem. Was anyone able to successfully install Ruby 2.0.0 on the newer mac?
