When I try to run my entire project in NetBeans I get the following error log:
...
Task :run FAILED
FAILURE: Build failed with an exception.
* What went wrong:
Execution failed for task ':run'.
> org.joor.ReflectException: java.lang.NoSuchFieldException: javaExecHandleBuilder
* Try:
Run with --stacktrace option to get the stack trace. Run with --info or --debug option to get more log output. Run with --scan to get full insights.
* Get more help at https://help.gradle.org
BUILD FAILED in 4s
I don't know what's going on, I specified the main class in build.gradle... Pls, help!