FAILURE: Build failed with an exception.
- What went wrong: A problem was found with the configuration of task ':app:processDebugResources'.
File 'C:\Users\g\AppData\Local\Android\sdk\platforms\android-28\android.jar' specified for property 'androidJar' does not exist.
Try: Run with --stacktrace option to get the stack trace. Run with --info or --debug option to get more log output. Run with --scan to get full insights.
Get more help at https://help.gradle.org
BUILD FAILED in 2m 10s Running Gradle task 'assembleDebug'... Running Gradle task 'assembleDebug'... Done 133.3s (!) Exception: Gradle task assembleDebug failed with exit code 1