Android studio error after update to 3.6.2

Viewed 433

I recently updated my android studio from 3.5 to 3.6.2. After that for all my projects I receive below error even for new projects with clean and empty activity.

Task :app:preBuild UP-TO-DATE

Task :app:preDebugBuild UP-TO-DATE

Task :app:compileDebugAidl NO-SOURCE

Task :app:generateDebugBuildConfig UP-TO-DATE

Task :app:compileDebugRenderscript NO-SOURCE

Task :app:javaPreCompileDebug FAILED

FAILURE: Build failed with an exception.

BUILD FAILED in 1s 2 actionable tasks: 1 executed, 1 up-to-date

0 Answers
Related