FAILURE: Build failed with an exception.
What went wrong:
Execution failed for task ':app:kaptDebugKotlin'.
> A failure occurred while executing org.jetbrains.kotlin.gradle.internal.KaptExecution
> java.lang.reflect.InvocationTargetException (no error message)
Caused by: org.gradle.workers.internal.DefaultWorkerExecutor$WorkExecutionException: A failure occurred while executing org.jetbrains.kotlin.gradle.internal.KaptExecution
Caused by: java.lang.reflect.InvocationTargetException
Caused by: org.jetbrains.kotlin.kapt3.base.util.KaptBaseError: Exception while annotation processing
Caused by: java.lang.IllegalArgumentException: couldn't make a guess for databinding.ActivityStartPageBindingImpl