Android Studio execution error message

Viewed 3825

A test project is created in Android Studio. Then immediately clicked on run or debug.

The following message pos up:

'Execution failed for task ':app:generateDebugBuildConfig'.
Failed to create D:\Project\Android\Asd\app\build\source\buildConfig\debug\com1\example\app`

One thing I found that Java folder is empty. But in the tutorial a default file is created by the IDE. Unfortunately here it is missing. If more information is needed please post it here. What I am missing, please help me.

***Sorry for the trouble. In response to the message:

Executing tasks: [:app:generateDebugSources]

:app:preBuild UP-TO-DATE
:app:preDebugBuild UP-TO-DATE
:app:prepareDebugDependencies
:app:compileDebugAidl UP-TO-DATE
:app:compileDebugRenderscript UP-TO-DATE
:app:generateDebugBuildConfig FAILED

FAILURE: Build failed with an exception.

* What went wrong:
Execution failed for task ':app:generateDebugBuildConfig'.
> Failed to create D:\Project\Android\Asd\app\build\source\buildConfig\debug\com1\example\app

* Try:
Run with --stacktrace option to get the stack trace. Run with --info or --debug option to get more log output.

BUILD FAILED

Total time: 2.994 secs
1 Answers
Related