SpiceQA
Questions
Tags
Users
Badges
react-native
13912 Questions
Newest
Active
Unanswered
Frequent
More
Score
View
Card
Compact
FAILURE: Build failed with an exception. * What went wrong: Task 'installDebug' not found in project ':app'
user_4397653
0
•
asked Mar 23, 2021
2
0
191
npm
react-native
reactjs
React native paper Appbar.Header not styling properly
user_14570211
0
•
asked Mar 23, 2021
1
1
1065
react-native
reactjs
useState hook causes "too many rerenders" error when using it in react-native
user_11245102
0
•
asked Mar 23, 2021
3
1
116
use-state
react-native
react-hooks
reactjs
@walletconnect/client throw Error: While trying to resolve module crypto
user_1002681
0
•
asked Mar 23, 2021
2
1
1633
react-native
Streaming RTMP with an overlay, react-native
user_15452738
0
•
asked Mar 23, 2021
2
0
568
react-native
rtmp
React-Native, Android bundleRelease failure at :app:createReleaseExpoManifest
user_12965111
0
•
asked Mar 23, 2021
1
0
132
expo
react-native
node.js
GitHub CI: Push React build to another repo
user_9898348
0
•
asked Mar 22, 2021
1
1
290
github-ci
github-actions
react-native
github
Combining Stack, Drawer and Tab Navigator
user_3935035
0
•
asked Mar 22, 2021
5
1
3321
react-navigation
react-native
javascript
expo-crypto hash not matching with the hash generated by Crypto JS in react web app
user_3255920
0
•
asked Mar 22, 2021
2
1
230
cryptojs
expo
react-native
reactjs
sha256
npm ERR! code ENOTEMPTY npm ERR! syscall rename while trying to install Expo for react native
user_13825190
0
•
asked Mar 22, 2021
2
1
5196
expo
react-native
zsh
command-line-interface
Prev
Prev
604
605
606
(current)
607
608
Next
Next
Hot Questions