FAILURE: Build failed with an exception.
- What went wrong: Execution failed for task ':app:checkDebugAarMetadata'.
Could not resolve all files for configuration ':app:debugRuntimeClasspath'. Could not find com.github.barteksc:android-pdf-viewer:3.2.0-beta.1. Searched in the following locations: - https://dl.google.com/dl/android/maven2/com/github/barteksc/android-pdf-viewer/3.2.0-beta.1/android-pdf-viewer-3.2.0-beta.1.pom - https://repo.maven.apache.org/maven2/com/github/barteksc/android-pdf-viewer/3.2.0-beta.1/android-pdf-viewer-3.2.0-beta.1.pom - https://storage.googleapis.com/download.flutter.io/com/github/barteksc/android-pdf-viewer/3.2.0-beta.1/android-pdf-viewer-3.2.0-beta.1.pom Required by: project :app > project :flutter_pdfview
Try: Run with --stacktrace option to get the stack trace. Run with --info or --debug option to get more log output. Run with --scan to get full insights.
Get more help at https://help.gradle.org
BUILD FAILED in 26s Exception: Gradle task assembleDebug failed with exit code 1