impossible to build flutter on device or simulator in my mac

Viewed 883

after two week... I successed upload xcode and catalina OS , zsh ... all could be good but have always error and can't launch my app on my physical device or simulator. Always error after Xcode build.

Things interesting, I remove App_review package from pubspec.yaml but I have always error with it... If I launch flutter example it works, but If I use certain package like admob who worked before, or app review I have this errors. I can remove app_review package but remove ad mob no...

Edit: I remove all packages who show error, but have always this error Here is my physical device error :

Xcode's output:
↳
   
    ld: framework not found FBLPromises
    clang: error: linker command failed with exit code 1 (use -v to see invocation)
    note: Using new build system
    note: Building targets in parallel

    note: Planning build
    note: Constructing build description

Here is the error when I use simulator :

Xcode's output:
↳
    ld: framework not found FBLPromises
    clang: error: linker command failed with exit code 1 (use -v to see invocation)
    note: Using new build system
    note: Building targets in parallel
    note: Planning build
    note: Constructing build description
    warning: Mapping architecture armv7 to i386. Ensure that this target's Architectures and Valid Architectures build settings are configured correctly for the iOS Simulator platform. (in target 'in_app_purchase' from project 'Pods')
    warning: Mapping architecture arm64 to x86_64. Ensure that this target's Architectures and Valid Architectures build settings are configured correctly for the iOS Simulator platform. (in target 'in_app_purchase' from project 'Pods')
    warning: Mapping architecture arm64 to x86_64. Ensure that this target's Architectures and Valid Architectures build settings are configured correctly for the iOS Simulator platform. (in target 'Runner' from project 'Runner')
    warning: Mapping architecture armv7s to i386. Ensure that this target's Architectures and Valid Architectures build settings are configured correctly for the iOS Simulator platform. (in target 'Runner' from project 'Runner')
    warning: Mapping architecture armv7 to i386. Ensure that this target's Architectures and Valid Architectures build settings are configured correctly for the iOS Simulator platform. (in target 'Runner' from project 'Runner')
3 Answers

Open Runner.xcodeproj with xCode in ios folder, choose File menu, then select "Project Settings...". In Build System, choose Legacy Build System and run again.

I have select legacy build system , now I have this last error

  === BUILD TARGET Runner OF PROJECT Runner WITH CONFIGURATION Debug ===
    ld: framework not found FBLPromises
    clang: error: linker command failed with exit code 1 (use -v to see invocation)
Related